Reaction Details
TargetAntithrombin-III
LigandBDBM50310313
Substrate/Competitorn/a
Meas. Tech.ChEMBL_607976 (CHEMBL1072392)
IC50>300000±n/a nM
Citation El-Ayache, NCLi, SHWarnock, MLawrence, DAEmal, CD Novel bis-arylsulfonamides and aryl sulfonimides as inactivators of plasminogen activator inhibitor-1 (PAI-1). Bioorg Med Chem Lett20:966-70 (2010) 
 
Antithrombin-III
Name:Antithrombin-III
Type:PROTEIN
Mol. Mass.:52602.34
Organism:Homo sapiens (Human)
Description:ChEMBL_35871
Residue:464
BDBM50310313
NameBDBM50310313
Synonyms:CHEMBL596860 | N,N'-(ethane-1,2-diyl)bis(N-ethyl-2,5-dihydroxybenzenesulfonamide)
TypeSmall organic molecule
Emp. Form.C18H24N2O8S2
Mol. Mass.460.522
SMILESCCN(CCN(CC)S(=O)(=O)c1cc(O)ccc1O)S(=O)(=O)c1cc(O)ccc1O