Reaction Details
TargetAntithrombin-III
LigandBDBM50310301
Substrate/Competitorn/a
Meas. Tech.ChEMBL_607976 (CHEMBL1072392)
IC50>1000000±n/a nM
Citation El-Ayache, NCLi, SHWarnock, MLawrence, DAEmal, CD Novel bis-arylsulfonamides and aryl sulfonimides as inactivators of plasminogen activator inhibitor-1 (PAI-1). Bioorg Med Chem Lett20:966-70 (2010) 
 
Antithrombin-III
Name:Antithrombin-III
Type:PROTEIN
Mol. Mass.:52602.34
Organism:Homo sapiens (Human)
Description:ChEMBL_35871
Residue:464
BDBM50310301
NameBDBM50310301
Synonyms:CHEMBL599742 US9120744, CDE-032
TypeSmall organic molecule
Emp. Form.C18H24N2O8S2
Mol. Mass.460.522
SMILESCCN(CCN(CC)S(=O)(=O)c1ccc(O)c(O)c1)S(=O)(=O)c1ccc(O)c(O)c1