Reaction Details
TargetMelanocortin receptor 4
LigandBDBM50310320
Substrate/Competitorn/a
Meas. Tech.ChEMBL_608234 (CHEMBL1072423)
EC50 3830±n/a nM
Citation Ovadia, OLinde, YHaskell-Luevano, CDirain, MLSheynis, TJelinek, RGilon, CHoffman, A The effect of backbone cyclization on PK/PD properties of bioactive peptide-peptoid hybrids: the melanocortin agonist paradigm. Bioorg Med Chem18:580-9 (2010) 
 
Melanocortin receptor 4
Name:Melanocortin receptor 4
Type:PROTEIN
Mol. Mass.:36964.43
Organism:Mus musculus
Description:ChEMBL_1498850
Residue:332
BDBM50310320
NameBDBM50310320
Synonyms:2-((6S,9S,15S)-6-((1H-indol-3-yl)methyl)-13,15-dibenzyl-9-(3-guanidinopropyl)-5,8,11,14,17,20-hexaoxo-1,4,7,10,13,16-hexaazacycloicosan-4-yl)acetamide | CHEMBL589516
TypeSmall organic molecule
Emp. Form.C43H53N11O7
Mol. Mass.835.9504
SMILESNC(=O)CN1CCNC(=O)CCC(=O)N[C@@H](Cc2ccccc2)C(=O)N(Cc2ccccc2)CC(=O)N[C@@H](CCCN=C(N)N)C(=O)N[C@@H](Cc2c[nH]c3ccccc23)C1=O