Reaction Details
TargetMelanocortin receptor 4
LigandBDBM50310326
Substrate/Competitorn/a
Meas. Tech.ChEMBL_608234 (CHEMBL1072423)
EC50 11±n/a nM
Citation Ovadia, OLinde, YHaskell-Luevano, CDirain, MLSheynis, TJelinek, RGilon, CHoffman, A The effect of backbone cyclization on PK/PD properties of bioactive peptide-peptoid hybrids: the melanocortin agonist paradigm. Bioorg Med Chem18:580-9 (2010) 
 
Melanocortin receptor 4
Name:Melanocortin receptor 4
Type:PROTEIN
Mol. Mass.:36964.43
Organism:Mus musculus
Description:ChEMBL_1498850
Residue:332
BDBM50310326
NameBDBM50310326
Synonyms:(S)-2-(2-(2-(2-acetamido-N-benzylacetamido)-N-benzylacetamido)acetamido)-N-((S)-1-(2-amino-2-oxoethylamino)-3-(1H-indol-3-yl)-1-oxopropan-2-yl)-5-guanidinopentanamide | CHEMBL589308
TypeSmall organic molecule
Emp. Form.C41H51N11O7
Mol. Mass.809.9131
SMILESCC(=O)NCC(=O)N(CC(=O)N(CC(=O)N[C@@H](CCCN=C(N)N)C(=O)N[C@@H](Cc1c[nH]c2ccccc12)C(=O)NCC(N)=O)Cc1ccccc1)Cc1ccccc1