Reaction Details
TargetMelanocyte-stimulating hormone receptor
LigandBDBM50310323
Substrate/Competitorn/a
Meas. Tech.ChEMBL_608232 (CHEMBL1072421)
EC50 11800±n/a nM
Citation Ovadia, OLinde, YHaskell-Luevano, CDirain, MLSheynis, TJelinek, RGilon, CHoffman, A The effect of backbone cyclization on PK/PD properties of bioactive peptide-peptoid hybrids: the melanocortin agonist paradigm. Bioorg Med Chem18:580-9 (2010) 
 
Melanocyte-stimulating hormone receptor
Name:Melanocyte-stimulating hormone receptor
Type:PROTEIN
Mol. Mass.:35238.60
Organism:Mus musculus
Description:ChEMBL_1498846
Residue:315
BDBM50310323
NameBDBM50310323
Synonyms:(S)-2-((R)-2-(2-(2-acetamido-N-benzylacetamido)acetamido)-3-phenylpropanamido)-N-((S)-1-(2-amino-2-oxoethylamino)-3-(1H-indol-3-yl)-1-oxopropan-2-yl)-5-guanidinopentanamide | CHEMBL602650
TypeSmall organic molecule
Emp. Form.C41H51N11O7
Mol. Mass.809.9131
SMILESCC(=O)NCC(=O)N(CC(=O)N[C@H](Cc1ccccc1)C(=O)N[C@@H](CCCN=C(N)N)C(=O)N[C@@H](Cc1c[nH]c2ccccc12)C(=O)NCC(N)=O)Cc1ccccc1