Reaction Details
TargetMelanocortin receptor 4
LigandBDBM50310316
Substrate/Competitorn/a
Meas. Tech.ChEMBL_608234 (CHEMBL1072423)
EC50 2250±n/a nM
Citation Ovadia, OLinde, YHaskell-Luevano, CDirain, MLSheynis, TJelinek, RGilon, CHoffman, A The effect of backbone cyclization on PK/PD properties of bioactive peptide-peptoid hybrids: the melanocortin agonist paradigm. Bioorg Med Chem18:580-9 (2010) 
 
Melanocortin receptor 4
Name:Melanocortin receptor 4
Type:PROTEIN
Mol. Mass.:36964.43
Organism:Mus musculus
Description:ChEMBL_1498850
Residue:332
BDBM50310316
NameBDBM50310316
Synonyms:2-((6S,9S)-6-((1H-indol-3-yl)methyl)-13,16-dibenzyl-9-(3-guanidinopropyl)-5,8,11,14,17,21-hexaoxo-1,4,7,10,13,16-hexaazacyclohenicosan-4-yl)acetamide | CHEMBL602852
TypeSmall organic molecule
Emp. Form.C44H55N11O7
Mol. Mass.849.977
SMILESNC(=O)CN1CCNC(=O)CCCC(=O)N(Cc2ccccc2)CC(=O)N(Cc2ccccc2)CC(=O)N[C@@H](CCCN=C(N)N)C(=O)N[C@@H](Cc2c[nH]c3ccccc23)C1=O