Reaction Details
TargetMelanocyte-stimulating hormone receptor
LigandBDBM50310314
Substrate/Competitorn/a
Meas. Tech.ChEMBL_608232 (CHEMBL1072421)
EC50 990±n/a nM
Citation Ovadia, OLinde, YHaskell-Luevano, CDirain, MLSheynis, TJelinek, RGilon, CHoffman, A The effect of backbone cyclization on PK/PD properties of bioactive peptide-peptoid hybrids: the melanocortin agonist paradigm. Bioorg Med Chem18:580-9 (2010) 
 
Melanocyte-stimulating hormone receptor
Name:Melanocyte-stimulating hormone receptor
Type:PROTEIN
Mol. Mass.:35238.60
Organism:Mus musculus
Description:ChEMBL_1498846
Residue:315
BDBM50310314
NameBDBM50310314
Synonyms:2-((6S,9S)-6-((1H-indol-3-yl)methyl)-13,16-dibenzyl-9-(3-guanidinopropyl)-5,8,11,14,17,22-hexaoxo-1,4,7,10,13,16-hexaazacyclodocosan-4-yl)acetamide | CHEMBL602299
TypeSmall organic molecule
Emp. Form.C45H57N11O7
Mol. Mass.864.0036
SMILESNC(=O)CN1CCNC(=O)CCCCC(=O)N(Cc2ccccc2)CC(=O)N(Cc2ccccc2)CC(=O)N[C@@H](CCCN=C(N)N)C(=O)N[C@@H](Cc2c[nH]c3ccccc23)C1=O