Reaction Details
TargetLysophosphatidic acid receptor 1
LigandBDBM50148348
Substrate/Competitorn/a
Meas. Tech.ChEMBL_608574 (CHEMBL1065839)
EC50 31±n/a nM
Citation Lu, YWang, ZLi, CMChen, JDalton, JTLi, WMiller, DD Synthesis, in vitro structure-activity relationship, and in vivo studies of 2-arylthiazolidine-4-carboxylic acid amides as anticancer agents. Bioorg Med Chem18:477-95 (2010) 
 
Lysophosphatidic acid receptor 1
Name:Lysophosphatidic acid receptor 1
Type:Enzyme
Mol. Mass.:41120.55
Organism:Homo sapiens (Human)
Description:Q92633
Residue:364
BDBM50148348
NameBDBM50148348
Synonyms:(R)-Octadec-9-enoic acid 2-hydroxy-3-phosphonooxy-propyl ester CHEMBL117021 | lysophosphatidic acid
TypeSmall organic molecule
Emp. Form.C21H41O7P
Mol. Mass.436.5198
SMILESCCCCCCCC\C=C/CCCCCCCC(=O)OC[C@@H](O)COP(O)(O)=O