Reaction Details
TargetcAMP-specific 3',5'-cyclic phosphodiesterase 4D
LigandBDBM50310364
Substrate/Competitorn/a
Meas. Tech.ChEMBL_622099 (CHEMBL1114098)
Kd 1000±n/a nM
Citation Mouri, ROishi, TTorikai, KUjihara, SMatsumori, NMurata, MOshima, Y Surface plasmon resonance-based detection of ladder-shaped polyethers by inhibition detection method. Bioorg Med Chem Lett19:2824-8 (2009) 
 
cAMP-specific 3',5'-cyclic phosphodiesterase 4D
Name:cAMP-specific 3',5'-cyclic phosphodiesterase 4D
Type:Protein
Mol. Mass.:91092.69
Organism:Homo sapiens (Human)
Description:Q08499
Residue:809
BDBM50310364
NameBDBM50310364
Synonyms:CHEMBL1077126 | YESSOTOXIN
TypeSmall organic molecule
Emp. Form.C55H80O20S2
Mol. Mass.1125.343
SMILESC[C@H]1CC[C@]2(C)O[C@]3(C)CC[C@@H]4O[C@@H]5C[C@@H]6O[C@@H]7C[C@H](OS([O-])(=O)=O)[C@@](C)(CCOS([O-])(=O)=O)O[C@H]7C[C@H]6O[C@H]5C[C@H]4O[C@H]3C[C@H]2O[C@H]2C[C@H]3O[C@H]4C[C@H]5O[C@@H](C(=C)C[C@@H]5O[C@]4(C)C[C@@H]3O[C@H]12)[C@](C)(O)\C=C\C(=C)CC=C