Reaction Details
TargetRibosomal protein S6 kinase beta-1
LigandBDBM50310453
Substrate/Competitorn/a
Meas. Tech.ChEMBL_619398 (CHEMBL1104156)
Ki 540±n/a nM
Citation Bandarage, UHare, BParsons, JPham, LMarhefka, CBemis, GTang, QMoody, CSRodems, SShah, SAdams, CBravo, JCharonnet, ESavic, VCome, JHGreen, J 4-(Benzimidazol-2-yl)-1,2,5-oxadiazol-3-ylamine derivatives: potent and selective p70S6 kinase inhibitors. Bioorg Med Chem Lett19:5191-4 (2009) 
 
Ribosomal protein S6 kinase beta-1
Name:Ribosomal protein S6 kinase beta-1
Type:Enzyme
Mol. Mass.:59139.89
Organism:Homo sapiens (Human)
Description:His-tagged S6K1.
Residue:525
BDBM50310453
NameBDBM50310453
Synonyms:4-(1-methyl-1H-benzo[d]imidazol-2-yl)-1,2,5-oxadiazol-3-amine cid_753058
TypeSmall organic molecule
Emp. Form.C10H9N5O
Mol. Mass.215.2114
SMILESCn1c(nc2ccccc12)-c1nonc1N