Reaction Details
TargetcAMP-dependent protein kinase catalytic subunit alpha
LigandBDBM50310460
Substrate/Competitorn/a
Meas. Tech.ChEMBL_619399 (CHEMBL1104157)
Ki 1400±n/a nM
Citation Bandarage, UHare, BParsons, JPham, LMarhefka, CBemis, GTang, QMoody, CSRodems, SShah, SAdams, CBravo, JCharonnet, ESavic, VCome, JHGreen, J 4-(Benzimidazol-2-yl)-1,2,5-oxadiazol-3-ylamine derivatives: potent and selective p70S6 kinase inhibitors. Bioorg Med Chem Lett19:5191-4 (2009) 
 
cAMP-dependent protein kinase catalytic subunit alpha
Name:cAMP-dependent protein kinase catalytic subunit alpha
Type:Enzyme Catalytic Subunit
Mol. Mass.:40598.73
Organism:Homo sapiens (Human)
Description:n/a
Residue:351
BDBM50310460
NameBDBM50310460
Synonyms:4-(1-(cyclobutylmethyl)-1H-benzo[d]imidazol-2-yl)-1,2,5-oxadiazol-3-amine | CHEMBL1078820
TypeSmall organic molecule
Emp. Form.C14H15N5O
Mol. Mass.269.3018
SMILESNc1nonc1-c1nc2ccccc2n1CC1CCC1