Reaction Details
TargetRibosomal protein S6 kinase beta-1
LigandBDBM50310462
Substrate/Competitorn/a
Meas. Tech.ChEMBL_619398 (CHEMBL1104156)
Ki 110±n/a nM
Citation Bandarage, UHare, BParsons, JPham, LMarhefka, CBemis, GTang, QMoody, CSRodems, SShah, SAdams, CBravo, JCharonnet, ESavic, VCome, JHGreen, J 4-(Benzimidazol-2-yl)-1,2,5-oxadiazol-3-ylamine derivatives: potent and selective p70S6 kinase inhibitors. Bioorg Med Chem Lett19:5191-4 (2009) 
 
Ribosomal protein S6 kinase beta-1
Name:Ribosomal protein S6 kinase beta-1
Type:Enzyme
Mol. Mass.:59139.89
Organism:Homo sapiens (Human)
Description:His-tagged S6K1.
Residue:525
BDBM50310462
NameBDBM50310462
Synonyms:4-(1-phenyl-1H-benzo[d]imidazol-2-yl)-1,2,5-oxadiazol-3-amine | CHEMBL1078426
TypeSmall organic molecule
Emp. Form.C15H11N5O
Mol. Mass.277.2807
SMILESNc1nonc1-c1nc2ccccc2n1-c1ccccc1