Reaction Details
TargetcAMP-dependent protein kinase catalytic subunit alpha
LigandBDBM50310463
Substrate/Competitorn/a
Meas. Tech.ChEMBL_619399 (CHEMBL1104157)
Ki>5000±n/a nM
Citation Bandarage, UHare, BParsons, JPham, LMarhefka, CBemis, GTang, QMoody, CSRodems, SShah, SAdams, CBravo, JCharonnet, ESavic, VCome, JHGreen, J 4-(Benzimidazol-2-yl)-1,2,5-oxadiazol-3-ylamine derivatives: potent and selective p70S6 kinase inhibitors. Bioorg Med Chem Lett19:5191-4 (2009) 
 
cAMP-dependent protein kinase catalytic subunit alpha
Name:cAMP-dependent protein kinase catalytic subunit alpha
Type:Enzyme Catalytic Subunit
Mol. Mass.:40598.73
Organism:Homo sapiens (Human)
Description:n/a
Residue:351
BDBM50310463
NameBDBM50310463
Synonyms:2-(2-(4-amino-1,2,5-oxadiazol-3-yl)-1H-benzo[d]imidazol-1-yl)benzonitrile | CHEMBL1078427
TypeSmall organic molecule
Emp. Form.C16H10N6O
Mol. Mass.302.2902
SMILESNc1nonc1-c1nc2ccccc2n1-c1ccccc1C#N