Reaction Details
TargetGlycogen synthase kinase-3 beta
LigandBDBM50310470
Substrate/Competitorn/a
Meas. Tech.ChEMBL_619400 (CHEMBL1104158)
Ki 2100±n/a nM
Citation Bandarage, UHare, BParsons, JPham, LMarhefka, CBemis, GTang, QMoody, CSRodems, SShah, SAdams, CBravo, JCharonnet, ESavic, VCome, JHGreen, J 4-(Benzimidazol-2-yl)-1,2,5-oxadiazol-3-ylamine derivatives: potent and selective p70S6 kinase inhibitors. Bioorg Med Chem Lett19:5191-4 (2009) 
 
Glycogen synthase kinase-3 beta
Name:Glycogen synthase kinase-3 beta
Type:Enzyme
Mol. Mass.:46756.38
Organism:Homo sapiens (Human)
Description:P49841
Residue:420
BDBM50310470
NameBDBM50310470
Synonyms:4-(5-amino-1-cyclobutyl-1H-benzo[d]imidazol-2-yl)-1,2,5-oxadiazol-3-amine | CHEMBL1080071
TypeSmall organic molecule
Emp. Form.C13H14N6O
Mol. Mass.270.2899
SMILESNc1nonc1-c1nc2cc(N)ccc2n1C1CCC1