Reaction Details
TargetC-X-C chemokine receptor type 3
LigandBDBM50310482
Substrate/Competitorn/a
Meas. Tech.ChEMBL_619413 (CHEMBL1104171)
IC50 20±n/a nM
Citation Liu, JFu, ZLi, ARJohnson, MZhu, LMarcus, ADanao, JSullivan, TTonn, GCollins, TMedina, J Optimization of a series of quinazolinone-derived antagonists of CXCR3. Bioorg Med Chem Lett19:5114-8 (2009) 
 
C-X-C chemokine receptor type 3
Name:C-X-C chemokine receptor type 3
Type:Enzyme Catalytic Domain
Mol. Mass.:40665.65
Organism:Homo sapiens (Human)
Description:n/a
Residue:368
BDBM50310482
NameBDBM50310482
Synonyms:(R)-N-(1-(3-(4-ethoxyphenyl)-4-oxo-3,4-dihydropyrido[2,3-d]pyrimidin-2-yl)ethyl)-2-(4-fluoro-3-(trifluoromethyl)phenyl)-N-((1-methylpiperidin-4-yl)methyl)acetamide | CHEMBL1077827
TypeSmall organic molecule
Emp. Form.C33H35F4N5O3
Mol. Mass.625.6563
SMILESCCOc1ccc(cc1)-n1c(nc2ncccc2c1=O)[C@@H](C)N(CC1CCN(C)CC1)C(=O)Cc1ccc(F)c(c1)C(F)(F)F