Reaction Details
TargetC-X-C chemokine receptor type 3
LigandBDBM50211130
Substrate/Competitorn/a
Meas. Tech.ChEMBL_619413 (CHEMBL1104171)
IC50 140±n/a nM
Citation Liu, JFu, ZLi, ARJohnson, MZhu, LMarcus, ADanao, JSullivan, TTonn, GCollins, TMedina, J Optimization of a series of quinazolinone-derived antagonists of CXCR3. Bioorg Med Chem Lett19:5114-8 (2009) 
 
C-X-C chemokine receptor type 3
Name:C-X-C chemokine receptor type 3
Type:Enzyme Catalytic Domain
Mol. Mass.:40665.65
Organism:Homo sapiens (Human)
Description:n/a
Residue:368
BDBM50211130
NameBDBM50211130
Synonyms:(R)-N-(1-(3-(4-ethoxyphenyl)-4-oxo-3,4-dihydroquinazolin-2-yl)ethyl)-N-(pyridin-3-ylmethyl)-2-(4-(trifluoromethoxy)phenyl)acetamide | CHEMBL230664
TypeSmall organic molecule
Emp. Form.C33H29F3N4O4
Mol. Mass.602.603
SMILESCCOc1ccc(cc1)-n1c(nc2ccccc2c1=O)[C@@H](C)N(Cc1cccnc1)C(=O)Cc1ccc(OC(F)(F)F)cc1