Reaction Details
TargetC-X-C chemokine receptor type 3
LigandBDBM50310501
Substrate/Competitorn/a
Meas. Tech.ChEMBL_619410 (CHEMBL1104168)
IC50 2±n/a nM
Citation Liu, JFu, ZLi, ARJohnson, MZhu, LMarcus, ADanao, JSullivan, TTonn, GCollins, TMedina, J Optimization of a series of quinazolinone-derived antagonists of CXCR3. Bioorg Med Chem Lett19:5114-8 (2009) 
 
C-X-C chemokine receptor type 3
Name:C-X-C chemokine receptor type 3
Type:Enzyme Catalytic Domain
Mol. Mass.:40665.65
Organism:Homo sapiens (Human)
Description:n/a
Residue:368
BDBM50310501
NameBDBM50310501
Synonyms:(R)-N-(1-(3-(4-ethoxyphenyl)-4-oxo-3,4-dihydroquinazolin-2-yl)ethyl)-2-(3-fluoro-4-(trifluoromethyl)phenyl)-N-(pyridin-3-ylmethyl)acetamide | CHEMBL1075640
TypeSmall organic molecule
Emp. Form.C33H28F4N4O3
Mol. Mass.604.594
SMILESCCOc1ccc(cc1)-n1c(nc2ccccc2c1=O)[C@@H](C)N(Cc1cccnc1)C(=O)Cc1ccc(c(F)c1)C(F)(F)F