Reaction Details
TargetAurora kinase B
LigandBDBM50310622
Substrate/Competitorn/a
Meas. Tech.ChEMBL_620386 (CHEMBL1112281)
IC50 21±n/a nM
Citation Zhong, MBui, MShen, WBaskaran, SAllen, DAElling, RAFlanagan, WMFung, ADHanan, EJHarris, SOHeumann, SAHoch, UIvy, SNJacobs, JWLam, SLee, HMcDowell, RSOslob, JDPurkey, HERomanowski, MJSilverman, JATangonan, BTTaverna, PYang, WYoburn, JCYu, CHZimmerman, KMO'Brien, TLew, W 2-Aminobenzimidazoles as potent Aurora kinase inhibitors. Bioorg Med Chem Lett19:5158-61 (2009) 
 
Aurora kinase B
Name:Aurora kinase B
Type:Protein
Mol. Mass.:39327.72
Organism:Homo sapiens (Human)
Description:Q96GD4
Residue:344
BDBM50310622
NameBDBM50310622
Synonyms:CHEMBL1078061 | N-(3-fluoro-4-(5-(trifluoromethyl)-1H-benzo[d]imidazol-2-ylamino)phenethyl)thieno[3,2-d]pyrimidin-4-amine
TypeSmall organic molecule
Emp. Form.C22H16F4N6S
Mol. Mass.472.461
SMILESFc1cc(CCNc2ncnc3ccsc23)ccc1Nc1nc2ccc(cc2[nH]1)C(F)(F)F