Reaction Details
TargetAurora kinase B
LigandBDBM50310612
Substrate/Competitorn/a
Meas. Tech.ChEMBL_620386 (CHEMBL1112281)
IC50 140±n/a nM
Citation Zhong, MBui, MShen, WBaskaran, SAllen, DAElling, RAFlanagan, WMFung, ADHanan, EJHarris, SOHeumann, SAHoch, UIvy, SNJacobs, JWLam, SLee, HMcDowell, RSOslob, JDPurkey, HERomanowski, MJSilverman, JATangonan, BTTaverna, PYang, WYoburn, JCYu, CHZimmerman, KMO'Brien, TLew, W 2-Aminobenzimidazoles as potent Aurora kinase inhibitors. Bioorg Med Chem Lett19:5158-61 (2009) 
 
Aurora kinase B
Name:Aurora kinase B
Type:Protein
Mol. Mass.:39327.72
Organism:Homo sapiens (Human)
Description:Q96GD4
Residue:344
BDBM50310612
NameBDBM50310612
Synonyms:CHEMBL1079051 | N-(4-(3H-imidazo[4,5-c]pyridin-2-ylamino)phenethyl)thieno[3,2-d]pyrimidin-4-amine
TypeSmall organic molecule
Emp. Form.C20H17N7S
Mol. Mass.387.461
SMILESC(Cc1ccc(Nc2nc3ccncc3[nH]2)cc1)Nc1ncnc2ccsc12