Reaction Details
TargetAurora kinase A
LigandBDBM50310622
Substrate/Competitorn/a
Meas. Tech.ChEMBL_620385 (CHEMBL1112280)
IC50 64±n/a nM
Citation Zhong, MBui, MShen, WBaskaran, SAllen, DAElling, RAFlanagan, WMFung, ADHanan, EJHarris, SOHeumann, SAHoch, UIvy, SNJacobs, JWLam, SLee, HMcDowell, RSOslob, JDPurkey, HERomanowski, MJSilverman, JATangonan, BTTaverna, PYang, WYoburn, JCYu, CHZimmerman, KMO'Brien, TLew, W 2-Aminobenzimidazoles as potent Aurora kinase inhibitors. Bioorg Med Chem Lett19:5158-61 (2009) 
 
Aurora kinase A
Name:Aurora kinase A
Type:Serine/threonine-protein kinase
Mol. Mass.:45830.98
Organism:Homo sapiens (Human)
Description:O14965
Residue:403
BDBM50310622
NameBDBM50310622
Synonyms:CHEMBL1078061 | N-(3-fluoro-4-(5-(trifluoromethyl)-1H-benzo[d]imidazol-2-ylamino)phenethyl)thieno[3,2-d]pyrimidin-4-amine
TypeSmall organic molecule
Emp. Form.C22H16F4N6S
Mol. Mass.472.461
SMILESFc1cc(CCNc2ncnc3ccsc23)ccc1Nc1nc2ccc(cc2[nH]1)C(F)(F)F