Reaction Details
TargetAurora kinase A
LigandBDBM50310619
Substrate/Competitorn/a
Meas. Tech.ChEMBL_620385 (CHEMBL1112280)
IC50 1400±n/a nM
Citation Zhong, MBui, MShen, WBaskaran, SAllen, DAElling, RAFlanagan, WMFung, ADHanan, EJHarris, SOHeumann, SAHoch, UIvy, SNJacobs, JWLam, SLee, HMcDowell, RSOslob, JDPurkey, HERomanowski, MJSilverman, JATangonan, BTTaverna, PYang, WYoburn, JCYu, CHZimmerman, KMO'Brien, TLew, W 2-Aminobenzimidazoles as potent Aurora kinase inhibitors. Bioorg Med Chem Lett19:5158-61 (2009) 
 
Aurora kinase A
Name:Aurora kinase A
Type:Serine/threonine-protein kinase
Mol. Mass.:45830.98
Organism:Homo sapiens (Human)
Description:O14965
Residue:403
BDBM50310619
NameBDBM50310619
Synonyms:CHEMBL1078827 | N-(2-(2-(1H-benzo[d]imidazol-2-ylamino)thiazol-5-yl)ethyl)thieno[3,2-d]pyrimidin-4-amine
TypeSmall organic molecule
Emp. Form.C18H15N7S2
Mol. Mass.393.489
SMILESC(Cc1cnc(Nc2nc3ccccc3[nH]2)s1)Nc1ncnc2ccsc12