Reaction Details
TargetReceptor-type tyrosine-protein kinase FLT3
LigandBDBM50310631
Substrate/Competitorn/a
Meas. Tech.ChEMBL_620389 (CHEMBL1112284)
Kd 0.98±n/a nM
Citation Patel, HKGrotzfeld, RMLai, AGMehta, SAMilanov, ZVChao, QSprankle, KGCarter, TAVelasco, AMFabian, MAJames, JTreiber, DKLockhart, DJZarrinkar, PPBhagwat, SS Arylcarboxyamino-substituted diaryl ureas as potent and selective FLT3 inhibitors. Bioorg Med Chem Lett19:5182-5 (2009) 
 
Receptor-type tyrosine-protein kinase FLT3
Name:Receptor-type tyrosine-protein kinase FLT3
Type:Enzyme
Mol. Mass.:112888.62
Organism:Homo sapiens (Human)
Description:P36888
Residue:993
BDBM50310631
NameBDBM50310631
Synonyms:CHEMBL1081169 | N-(4-(3-(5-tert-butylisoxazol-3-yl)ureido)phenyl)benzamide
TypeSmall organic molecule
Emp. Form.C21H22N4O3
Mol. Mass.378.4244
SMILESCC(C)(C)c1cc(NC(=O)Nc2ccc(NC(=O)c3ccccc3)cc2)no1