Reaction Details
TargetReceptor-type tyrosine-protein kinase FLT3
LigandBDBM50310643
Substrate/Competitorn/a
Meas. Tech.ChEMBL_620389 (CHEMBL1112284)
Kd 38.4±n/a nM
Citation Patel, HKGrotzfeld, RMLai, AGMehta, SAMilanov, ZVChao, QSprankle, KGCarter, TAVelasco, AMFabian, MAJames, JTreiber, DKLockhart, DJZarrinkar, PPBhagwat, SS Arylcarboxyamino-substituted diaryl ureas as potent and selective FLT3 inhibitors. Bioorg Med Chem Lett19:5182-5 (2009) 
 
Receptor-type tyrosine-protein kinase FLT3
Name:Receptor-type tyrosine-protein kinase FLT3
Type:Enzyme
Mol. Mass.:112888.62
Organism:Homo sapiens (Human)
Description:P36888
Residue:993
BDBM50310643
NameBDBM50310643
Synonyms:4-(3-(5-tert-butylisoxazol-3-yl)ureido)-N-(pyridin-4-yl)benzamide | CHEMBL1080784
TypeSmall organic molecule
Emp. Form.C20H21N5O3
Mol. Mass.379.4124
SMILESCC(C)(C)c1cc(NC(=O)Nc2ccc(cc2)C(=O)Nc2ccncc2)no1