Reaction Details
TargetPlatelet-derived growth factor receptor alpha
LigandBDBM50300691
Substrate/Competitorn/a
Meas. Tech.ChEMBL_620395 (CHEMBL1112290)
Kd 4.3±n/a nM
Citation Patel, HKGrotzfeld, RMLai, AGMehta, SAMilanov, ZVChao, QSprankle, KGCarter, TAVelasco, AMFabian, MAJames, JTreiber, DKLockhart, DJZarrinkar, PPBhagwat, SS Arylcarboxyamino-substituted diaryl ureas as potent and selective FLT3 inhibitors. Bioorg Med Chem Lett19:5182-5 (2009) 
 
Platelet-derived growth factor receptor alpha
Name:Platelet-derived growth factor receptor alpha
Type:Protein
Mol. Mass.:122633.38
Organism:Homo sapiens (Human)
Description:P16234
Residue:1089
BDBM50300691
NameBDBM50300691
Synonyms:Benzo[d]imidazo[2,1-b]thiazole-2-carboxylic acid {4-[3-(5-tert-butyl-isoxazol-3-yl)-ureido]-phenyl}-amide CHEMBL575925
TypeSmall organic molecule
Emp. Form.C24H22N6O3S
Mol. Mass.474.535
SMILESCC(C)(C)c1cc(NC(=O)Nc2ccc(NC(=O)c3cn4c(n3)sc3ccccc43)cc2)no1