Reaction Details
TargetPotassium voltage-gated channel subfamily H member 2
LigandBDBM50310645
Substrate/Competitorn/a
Meas. Tech.ChEMBL_620410 (CHEMBL1112305)
IC50 7740±n/a nM
Citation Wakenhut, FAllan, GAFish, PVFray, MJHarrison, ACMcCoy, RPhillips, SCRyckmans, TStobie, AWestbrook, DWestbrook, SLWhitlock, GA N-[(3S)-Pyrrolidin-3-yl]benzamides as novel dual serotonin and noradrenaline reuptake inhibitors: impact of small structural modifications on P-gp recognition and CNS penetration. Bioorg Med Chem Lett19:5078-81 (2009) 
 
Potassium voltage-gated channel subfamily H member 2
Name:Potassium voltage-gated channel subfamily H member 2
Type:Multi-pass membrane protein
Mol. Mass.:126672.65
Organism:Homo sapiens (Human)
Description:Q12809
Residue:1159
BDBM50310645
NameBDBM50310645
Synonyms:(S)-2,3-dichloro-N-(pentan-3-yl)-N-(pyrrolidin-3-yl)benzamide | CHEMBL1080969
TypeSmall organic molecule
Emp. Form.C16H22Cl2N2O
Mol. Mass.329.265
SMILESCCC(CC)N([C@H]1CCNC1)C(=O)c1cccc(Cl)c1Cl