Reaction Details
TargetSodium-dependent serotonin transporter
LigandBDBM50310652
Substrate/Competitorn/a
Meas. Tech.ChEMBL_620406 (CHEMBL1112301)
Ki 3±n/a nM
Citation Wakenhut, FAllan, GAFish, PVFray, MJHarrison, ACMcCoy, RPhillips, SCRyckmans, TStobie, AWestbrook, DWestbrook, SLWhitlock, GA N-[(3S)-Pyrrolidin-3-yl]benzamides as novel dual serotonin and noradrenaline reuptake inhibitors: impact of small structural modifications on P-gp recognition and CNS penetration. Bioorg Med Chem Lett19:5078-81 (2009) 
 
Sodium-dependent serotonin transporter
Name:Sodium-dependent serotonin transporter
Type:Multi-pass membrane protein
Mol. Mass.:70322.51
Organism:Homo sapiens (Human)
Description:P31645
Residue:630
BDBM50310652
NameBDBM50310652
Synonyms:(S)-3-chloro-N-isobutyl-2-methyl-N-(pyrrolidin-3-yl)benzamide | CHEMBL1078162
TypeSmall organic molecule
Emp. Form.C16H23ClN2O
Mol. Mass.294.82
SMILESCC(C)CN([C@H]1CCNC1)C(=O)c1cccc(Cl)c1C