Reaction Details
TargetSodium-dependent noradrenaline transporter
LigandBDBM50310649
Substrate/Competitorn/a
Meas. Tech.ChEMBL_620407 (CHEMBL1112302)
Ki 43±n/a nM
Citation Wakenhut, FAllan, GAFish, PVFray, MJHarrison, ACMcCoy, RPhillips, SCRyckmans, TStobie, AWestbrook, DWestbrook, SLWhitlock, GA N-[(3S)-Pyrrolidin-3-yl]benzamides as novel dual serotonin and noradrenaline reuptake inhibitors: impact of small structural modifications on P-gp recognition and CNS penetration. Bioorg Med Chem Lett19:5078-81 (2009) 
 
Sodium-dependent noradrenaline transporter
Name:Sodium-dependent noradrenaline transporter
Type:Multi-pass membrane protein
Mol. Mass.:69337.72
Organism:Homo sapiens (Human)
Description:P23975
Residue:617
BDBM50310649
NameBDBM50310649
Synonyms:(S)-3,5-dichloro-N-isobutyl-N-(pyrrolidin-3-yl)benzamide | CHEMBL1078741
TypeSmall organic molecule
Emp. Form.C15H20Cl2N2O
Mol. Mass.315.238
SMILESCC(C)CN([C@H]1CCNC1)C(=O)c1cc(Cl)cc(Cl)c1