Reaction Details
TargetSodium-dependent noradrenaline transporter
LigandBDBM50310666
Substrate/Competitorn/a
Meas. Tech.ChEMBL_620407 (CHEMBL1112302)
Ki 263±n/a nM
Citation Wakenhut, FAllan, GAFish, PVFray, MJHarrison, ACMcCoy, RPhillips, SCRyckmans, TStobie, AWestbrook, DWestbrook, SLWhitlock, GA N-[(3S)-Pyrrolidin-3-yl]benzamides as novel dual serotonin and noradrenaline reuptake inhibitors: impact of small structural modifications on P-gp recognition and CNS penetration. Bioorg Med Chem Lett19:5078-81 (2009) 
 
Sodium-dependent noradrenaline transporter
Name:Sodium-dependent noradrenaline transporter
Type:Multi-pass membrane protein
Mol. Mass.:69337.72
Organism:Homo sapiens (Human)
Description:P23975
Residue:617
BDBM50310666
NameBDBM50310666
Synonyms:(S)-2-chloro-4-fluoro-N-isobutyl-N-(pyrrolidin-3-yl)benzamide | CHEMBL1078076
TypeSmall organic molecule
Emp. Form.C15H20ClFN2O
Mol. Mass.298.784
SMILESCC(C)CN([C@H]1CCNC1)C(=O)c1ccc(F)cc1Cl