Reaction Details
TargetSodium-dependent dopamine transporter
LigandBDBM50310660
Substrate/Competitorn/a
Meas. Tech.ChEMBL_620408 (CHEMBL1112303)
Ki 404±n/a nM
Citation Wakenhut, FAllan, GAFish, PVFray, MJHarrison, ACMcCoy, RPhillips, SCRyckmans, TStobie, AWestbrook, DWestbrook, SLWhitlock, GA N-[(3S)-Pyrrolidin-3-yl]benzamides as novel dual serotonin and noradrenaline reuptake inhibitors: impact of small structural modifications on P-gp recognition and CNS penetration. Bioorg Med Chem Lett19:5078-81 (2009) 
 
Sodium-dependent dopamine transporter
Name:Sodium-dependent dopamine transporter
Type:Multi-pass membrane protein
Mol. Mass.:68497.11
Organism:Homo sapiens (Human)
Description:Q01959
Residue:620
BDBM50310660
NameBDBM50310660
Synonyms:(S)-2,3-dichloro-N-(2-cyclopropylethyl)-N-(pyrrolidin-3-yl)benzamide | CHEMBL1080789
TypeSmall organic molecule
Emp. Form.C16H20Cl2N2O
Mol. Mass.327.249
SMILESClc1cccc(C(=O)N(CCC2CC2)[C@H]2CCNC2)c1Cl