Reaction Details
TargetSodium-dependent dopamine transporter
LigandBDBM50310653
Substrate/Competitorn/a
Meas. Tech.ChEMBL_620408 (CHEMBL1112303)
Ki 2560±n/a nM
Citation Wakenhut, FAllan, GAFish, PVFray, MJHarrison, ACMcCoy, RPhillips, SCRyckmans, TStobie, AWestbrook, DWestbrook, SLWhitlock, GA N-[(3S)-Pyrrolidin-3-yl]benzamides as novel dual serotonin and noradrenaline reuptake inhibitors: impact of small structural modifications on P-gp recognition and CNS penetration. Bioorg Med Chem Lett19:5078-81 (2009) 
 
Sodium-dependent dopamine transporter
Name:Sodium-dependent dopamine transporter
Type:Multi-pass membrane protein
Mol. Mass.:68497.11
Organism:Homo sapiens (Human)
Description:Q01959
Residue:620
BDBM50310653
NameBDBM50310653
Synonyms:(S)-3-chloro-2-fluoro-N-isobutyl-N-(pyrrolidin-3-yl)benzamide | CHEMBL1078073
TypeSmall organic molecule
Emp. Form.C15H20ClFN2O
Mol. Mass.298.784
SMILESCC(C)CN([C@H]1CCNC1)C(=O)c1cccc(Cl)c1F