Reaction Details
TargetPotassium two pore domain channel subfamily K member 2
LigandBDBM50067040
Substrate/Competitorn/a
Meas. Tech.ChEMBL_620769 (CHEMBL1107655)
IC50 930±n/a nM
Citation Enyeart, JALiu, HEnyeart, JJ Curcumin inhibits ACTH- and angiotensin II-stimulated cortisol secretion and Ca(v)3.2 current. J Nat Prod72:1533-7 (2009) 
 
Potassium two pore domain channel subfamily K member 2
Name:Potassium two pore domain channel subfamily K member 2
Synonyms:Potassium channel subfamily K member 2
Type:PROTEIN
Mol. Mass.:45443.30
Organism:Bos taurus
Description:ChEMBL_620769
Residue:411
BDBM50067040
NameBDBM50067040
TypeSmall organic molecule
Emp. Form.C21H20O6
Mol. Mass.368.3799
SMILESCOc1cc(C=CC(=O)CC(=O)C=Cc2ccc(O)c(OC)c2)ccc1O