Reaction Details
TargetDipeptidyl peptidase 1
LigandBDBM50310682
Substrate/Competitorn/a
Meas. Tech.ChEMBL_621086 (CHEMBL1113170)
IC50 0.300000±n/a nM
Citation Guay, DBeaulieu, CTruchon, JFJagadeeswar Reddy, TZamboni, RBayly, CIMethot, NRubin, JEthier, DDavid Percival, M Design and synthesis of dipeptidyl nitriles as potent, selective, and reversible inhibitors of cathepsin C. Bioorg Med Chem Lett19:5392-6 (2009) 
 
Dipeptidyl peptidase 1
Name:Dipeptidyl peptidase 1
Type:Enzyme
Mol. Mass.:51857.28
Organism:Homo sapiens (Human)
Description:P53634
Residue:463
BDBM50310682
NameBDBM50310682
Synonyms:(S)-2-amino-N-((S)-1-cyano-2-(5-phenylthiophen-2-yl)ethyl)-3-(thiophen-2-yl)propanamide | CHEMBL1079888
TypeSmall organic molecule
Emp. Form.C20H19N3OS2
Mol. Mass.381.514
SMILESN[C@@H](Cc1cccs1)C(=O)N[C@@H](Cc1ccc(s1)-c1ccccc1)C#N