Reaction Details
TargetC-C chemokine receptor type 5
LigandBDBM50310744
Substrate/Competitorn/a
Meas. Tech.ChEMBL_621115 (CHEMBL1113199)
IC50 12±n/a nM
Citation Rotstein, DMGabriel, SDMakra, FFilonova, LGleason, SBrotherton-Pleiss, CSetti, LQTrejo-Martin, ALee, EKSankuratri, SJi, CDerosier, ADioszegi, MHeilek, GJekle, ABerry, PWeller, PMau, CI Spiropiperidine CCR5 antagonists. Bioorg Med Chem Lett19:5401-6 (2009) 
 
C-C chemokine receptor type 5
Name:C-C chemokine receptor type 5
Type:Enzyme
Mol. Mass.:40540.21
Organism:Homo sapiens (Human)
Description:P51681
Residue:352
BDBM50310744
NameBDBM50310744
Synonyms:(S)-5-butyl-9-(1-(4,6-dimethyl-2-oxo-2H-pyran-5-carbonyl)-4-methylpiperidin-4-yl)-3-((tetrahydro-2H-pyran-4-yl)methyl)-1-oxa-3,9-diazaspiro[5.5]undecan-2-one | CHEMBL1078712
TypeSmall organic molecule
Emp. Form.C32H49N3O6
Mol. Mass.571.748
SMILESCCCC[C@H]1CN(CC2CCOCC2)C(=O)OC11CCN(CC1)C1(C)CCN(CC1)C(=O)c1c(C)cc(=O)oc1C