Reaction Details
TargetCytochrome P450 3A4
LigandBDBM50310764
Substrate/Competitorn/a
Meas. Tech.ChEMBL_621465 (CHEMBL1100026)
IC50 60±n/a nM
Citation Flentge, CARandolph, JTHuang, PPKlein, LLMarsh, KCHarlan, JEKempf, DJ Synthesis and evaluation of inhibitors of cytochrome P450 3A (CYP3A) for pharmacokinetic enhancement of drugs. Bioorg Med Chem Lett19:5444-8 (2009) 
 
Cytochrome P450 3A4
Name:Cytochrome P450 3A4
Type:Enzyme
Mol. Mass.:57349.57
Organism:Homo sapiens (Human)
Description:n/a
Residue:503
BDBM50310764
NameBDBM50310764
Synonyms:Bis-N-[(R)-2-(thiazol-5-ylmethoxycarbonylamino)-3-phenylpropyl]-N-[benzyl]amine | CHEMBL1077936
TypeSmall organic molecule
Emp. Form.C35H37N5O4S2
Mol. Mass.655.829
SMILESO=C(N[C@@H](CN(C[C@@H](Cc1ccccc1)NC(=O)OCc1nccs1)Cc1ccccc1)Cc1ccccc1)OCc1cncs1