Reaction Details
TargetCytochrome P450 3A4
LigandBDBM50310765
Substrate/Competitorn/a
Meas. Tech.ChEMBL_621465 (CHEMBL1100026)
IC50 50±n/a nM
Citation Flentge, CARandolph, JTHuang, PPKlein, LLMarsh, KCHarlan, JEKempf, DJ Synthesis and evaluation of inhibitors of cytochrome P450 3A (CYP3A) for pharmacokinetic enhancement of drugs. Bioorg Med Chem Lett19:5444-8 (2009) 
 
Cytochrome P450 3A4
Name:Cytochrome P450 3A4
Type:Enzyme
Mol. Mass.:57349.57
Organism:Homo sapiens (Human)
Description:n/a
Residue:503
BDBM50310765
NameBDBM50310765
Synonyms:CHEMBL1077937 | N-[(S)-2-(thiazol-5-ylmethoxycarbonylamino)-3-phenylpropyl][(R)-2-(thiazol-5-ylmethoxycarbonylamino)-3-phenylpropyl][3-methoxybenzyl]amine
TypeSmall organic molecule
Emp. Form.C36H39N5O5S2
Mol. Mass.685.855
SMILESCOc1cccc(CN(C[C@H](Cc2ccccc2)NC(=O)OCc2cncs2)C[C@@H](Cc2ccccc2)NC(=O)OCc2nccs2)c1