Reaction Details
TargetCytochrome P450 3A4
LigandBDBM50310772
Substrate/Competitorn/a
Meas. Tech.ChEMBL_621465 (CHEMBL1100026)
IC50 1790±n/a nM
Citation Flentge, CARandolph, JTHuang, PPKlein, LLMarsh, KCHarlan, JEKempf, DJ Synthesis and evaluation of inhibitors of cytochrome P450 3A (CYP3A) for pharmacokinetic enhancement of drugs. Bioorg Med Chem Lett19:5444-8 (2009) 
 
Cytochrome P450 3A4
Name:Cytochrome P450 3A4
Type:Enzyme
Mol. Mass.:57349.57
Organism:Homo sapiens (Human)
Description:n/a
Residue:503
BDBM50310772
NameBDBM50310772
Synonyms:CHEMBL1080417 | N-[(S)-2-(thiazol-5-ylmethoxycarbonylamino)propyl]-N-[(R)-2-(thiazol-5-ylmethoxycarbonylamino)propyl]ethylamine
TypeSmall organic molecule
Emp. Form.C18H27N5O4S2
Mol. Mass.441.568
SMILESCCN(C[C@H](C)NC(=O)OCc1cncs1)C[C@@H](C)NC(=O)OCc1nccs1