Reaction Details
TargetCytochrome P450 3A4
LigandBDBM50310778
Substrate/Competitorn/a
Meas. Tech.ChEMBL_621465 (CHEMBL1100026)
IC50 91±n/a nM
Citation Flentge, CARandolph, JTHuang, PPKlein, LLMarsh, KCHarlan, JEKempf, DJ Synthesis and evaluation of inhibitors of cytochrome P450 3A (CYP3A) for pharmacokinetic enhancement of drugs. Bioorg Med Chem Lett19:5444-8 (2009) 
 
Cytochrome P450 3A4
Name:Cytochrome P450 3A4
Type:Enzyme
Mol. Mass.:57349.57
Organism:Homo sapiens (Human)
Description:n/a
Residue:503
BDBM50310778
NameBDBM50310778
Synonyms:CHEMBL1078122 | N-[(S)-2-(thiazol-5-ylmethoxycarbonylamino)-3-(4-phenylmethoxyphenyl)propyl]-N-[2-(thiazol-5-ylmethoxycarbonylamino)-3-(4-phenylmethoxyphenyl)propyl]-ethylamine
TypeSmall organic molecule
Emp. Form.C30H35N5O6S2
Mol. Mass.625.759
SMILESCCN(CC(Cc1ccc(O)cc1)NC(=O)OCc1cncs1)CC(Cc1ccc(O)cc1)NC(=O)OCc1nccs1