Reaction Details
TargetBifunctional epoxide hydrolase 2
LigandBDBM50310797
Substrate/Competitorn/a
Meas. Tech.ChEMBL_621473 (CHEMBL1100034)
IC50 3±n/a nM
Citation Shen, HCDing, FXDeng, QXu, SChen, HSTong, XTong, VZhang, XChen, YZhou, GPai, LYAlonso-Galicia, MZhang, BRoy, STata, JRBerger, JPColletti, SL Discovery of 3,3-disubstituted piperidine-derived trisubstituted ureas as highly potent soluble epoxide hydrolase inhibitors. Bioorg Med Chem Lett19:5314-20 (2009) 
 
Bifunctional epoxide hydrolase 2
Name:Bifunctional epoxide hydrolase 2
Type:PROTEIN
Mol. Mass.:62337.15
Organism:Rattus norvegicus
Description:ChEMBL_1465995
Residue:554
BDBM50310797
NameBDBM50310797
Synonyms:3-methyl-3-phenyl-N-(4-(pyridin-2-yl)benzyl)piperidine-1-carboxamide | CHEMBL1081703
TypeSmall organic molecule
Emp. Form.C25H27N3O
Mol. Mass.385.5014
SMILESCC1(CCCN(C1)C(=O)NCc1ccc(cc1)-c1ccccn1)c1ccccc1