Reaction Details
TargetBifunctional epoxide hydrolase 2
LigandBDBM50310822
Substrate/Competitorn/a
Meas. Tech.ChEMBL_621473 (CHEMBL1100034)
IC50 3±n/a nM
Citation Shen, HCDing, FXDeng, QXu, SChen, HSTong, XTong, VZhang, XChen, YZhou, GPai, LYAlonso-Galicia, MZhang, BRoy, STata, JRBerger, JPColletti, SL Discovery of 3,3-disubstituted piperidine-derived trisubstituted ureas as highly potent soluble epoxide hydrolase inhibitors. Bioorg Med Chem Lett19:5314-20 (2009) 
 
Bifunctional epoxide hydrolase 2
Name:Bifunctional epoxide hydrolase 2
Type:PROTEIN
Mol. Mass.:62337.15
Organism:Rattus norvegicus
Description:ChEMBL_1465995
Residue:554
BDBM50310822
NameBDBM50310822
Synonyms:CHEMBL1078754 | methyl 3-(1-(4-chlorophenylcarbamoyl)-3-phenylpiperidin-3-yl)propanoate
TypeSmall organic molecule
Emp. Form.C22H25ClN2O3
Mol. Mass.400.899
SMILESCOC(=O)CCC1(CCCN(C1)C(=O)Nc1ccc(Cl)cc1)c1ccccc1