Reaction Details
Target72 kDa type IV collagenase
LigandBDBM50310829
Substrate/Competitorn/a
Meas. Tech.ChEMBL_622215 (CHEMBL1106839)
IC50>100000±n/a nM
Citation Murata, TSasaki, KSato, KYoshizaki, FYamada, HMutoh, HUmehara, KMiyase, TWarashina, TAoshima, HTabata, HMatsubara, K Matrix metalloproteinase-2 inhibitors from Clinopodium chinense var. parviflorum. J Nat Prod72:1379-84 (2009) 
 
72 kDa type IV collagenase
Name:72 kDa type IV collagenase
Type:n/a
Mol. Mass.:74137.51
Organism:Rattus norvegicus (Rat)
Description:P33436
Residue:662
BDBM50310829
NameBDBM50310829
Synonyms:CHEMBL1081512 | clinopodic acid E
TypeSmall organic molecule
Emp. Form.C27H22O12
Mol. Mass.538.4564
SMILESOC(=O)[C@@H](Cc1ccc(O)c(O)c1)OC(=O)\C=C\c1ccc2O[C@@H]([C@@H](Oc2c1)C(O)=O)c1ccc(O)c(O)c1