Reaction Details
TargetTelomerase reverse transcriptase
LigandBDBM50134019
Substrate/Competitorn/a
Meas. Tech.ChEMBL_622825 (CHEMBL1105835)
IC50 60±n/a nM
Citation Castillo-González, DCabrera-Pérez, MAPérez-González, MMorales Helguera, ADurán-Martínez, A Prediction of telomerase inhibitory activity for acridinic derivatives based on chemical structure. Eur J Med Chem44:4826-40 (2009) 
 
Telomerase reverse transcriptase
Name:Telomerase reverse transcriptase
Type:PROTEIN
Mol. Mass.:127099.03
Organism:Homo sapiens (Human)
Description:ChEMBL_1447029
Residue:1132
BDBM50134019
NameBDBM50134019
Synonyms:CHEMBL336417 N-[9-(3-Amino-phenylamino)-6-(3-pyrrolidin-1-yl-propionylamino)-acridin-3-yl]-3-pyrrolidin-1-yl-propionamide
TypeSmall organic molecule
Emp. Form.C33H39N7O2
Mol. Mass.565.7085
SMILESNc1cccc(Nc2c3ccc(NC(=O)CCN4CCCC4)cc3nc3cc(NC(=O)CCN4CCCC4)ccc23)c1