Reaction Details
TargetTelomerase reverse transcriptase
LigandBDBM50134032
Substrate/Competitorn/a
Meas. Tech.ChEMBL_622825 (CHEMBL1105835)
IC50 50±n/a nM
Citation Castillo-González, DCabrera-Pérez, MAPérez-González, MMorales Helguera, ADurán-Martínez, A Prediction of telomerase inhibitory activity for acridinic derivatives based on chemical structure. Eur J Med Chem44:4826-40 (2009) 
 
Telomerase reverse transcriptase
Name:Telomerase reverse transcriptase
Type:PROTEIN
Mol. Mass.:127099.03
Organism:Homo sapiens (Human)
Description:ChEMBL_1447029
Residue:1132
BDBM50134032
NameBDBM50134032
Synonyms:CHEMBL138811 N-[9-Cyclopropylamino-6-(3-pyrrolidin-1-yl-propionylamino)-acridin-3-yl]-3-pyrrolidin-1-yl-propionamide
TypeSmall organic molecule
Emp. Form.C30H38N6O2
Mol. Mass.514.6617
SMILESO=C(CCN1CCCC1)Nc1ccc2c(NC3CC3)c3ccc(NC(=O)CCN4CCCC4)cc3nc2c1