Reaction Details
TargetFatty acid-binding protein, liver
LigandBDBM50310988
Substrate/Competitorn/a
Meas. Tech.ChEMBL_619185 (CHEMBL1102423)
Ki 8170±n/a nM
Citation Hertzel, AVHellberg, KReynolds, JMKruse, ACJuhlmann, BESmith, AJSanders, MAOhlendorf, DHSuttles, JBernlohr, DA Identification and characterization of a small molecule inhibitor of Fatty Acid binding proteins. J Med Chem52:6024-31 (2009) 
 
Fatty acid-binding protein, liver
Name:Fatty acid-binding protein, liver
Type:Protein
Mol. Mass.:14208.72
Organism:Homo sapiens (Human)
Description:human L-FABP
Residue:127
BDBM50310988
NameBDBM50310988
Synonyms:4-{[2-(methoxycarbonyl)-5-(2-thienyl)-3-thienyl]amino}-4-oxo-2-butenoic acid CHEMBL1077990
TypeSmall organic molecule
Emp. Form.C14H11NO5S2
Mol. Mass.337.371
SMILESCOC(=O)c1sc(cc1NC(=O)\C=C\C(O)=O)-c1cccs1