Reaction Details
TargetAlpha-2C adrenergic receptor
LigandBDBM50311076
Substrate/Competitorn/a
Meas. Tech.ChEMBL_619545 (CHEMBL1111402)
Ki>10000±n/a nM
Citation Donohue, SRVarnäs, KJia, ZGulyás, BPike, VWHalldin, C Synthesis and in vitro autoradiographic evaluation of a novel high-affinity radioiodinated ligand for imaging brain cannabinoid subtype-1 receptors. Bioorg Med Chem Lett19:6209-12 (2009) 
 
Alpha-2C adrenergic receptor
Name:Alpha-2C adrenergic receptor
Type:Enzyme
Mol. Mass.:49552.32
Organism:Homo sapiens (Human)
Description:P18825
Residue:462
BDBM50311076
NameBDBM50311076
Synonyms:CHEMBL1079079 | [125I]1-(2-iodophenyl)-4-cyano-5-(4-methoxyphenyl)-N-(piperidin-1-yl)-1H-pyrazole-3-carboxylate
TypeSmall organic molecule
Emp. Form.C23H22IN5O2
Mol. Mass.527.3576
SMILESCOc1ccc(cc1)-c1c(C#N)c(nn1-c1ccccc1I)C(=O)NN1CCCCC1