Reaction Details
TargetEphrin type-B receptor 3
LigandBDBM50311290
Substrate/Competitorn/a
Meas. Tech.ChEMBL_620507 (CHEMBL1107575)
IC50 20000±n/a nM
Citation Qiao, LChoi, SCase, AGainer, TGSeyb, KGlicksman, MALo, DCStein, RLCuny, GD Structure-activity relationship study of EphB3 receptor tyrosine kinase inhibitors. Bioorg Med Chem Lett19:6122-6 (2009) 
 
Ephrin type-B receptor 3
Name:Ephrin type-B receptor 3
Type:Protein
Mol. Mass.:110326.17
Organism:Homo sapiens (Human)
Description:P54753
Residue:998
BDBM50311290
NameBDBM50311290
Synonyms:CHEMBL1079075 | N-(2,3-dichlorophenyl)pyrazolo[1,5-a]pyridine-3-carboxamide
TypeSmall organic molecule
Emp. Form.C14H9Cl2N3O
Mol. Mass.306.147
SMILESClc1cccc(NC(=O)c2cnn3ccccc23)c1Cl