Reaction Details
TargetEphrin type-B receptor 3
LigandBDBM50311296
Substrate/Competitorn/a
Meas. Tech.ChEMBL_620507 (CHEMBL1107575)
IC50 260±n/a nM
Citation Qiao, LChoi, SCase, AGainer, TGSeyb, KGlicksman, MALo, DCStein, RLCuny, GD Structure-activity relationship study of EphB3 receptor tyrosine kinase inhibitors. Bioorg Med Chem Lett19:6122-6 (2009) 
 
Ephrin type-B receptor 3
Name:Ephrin type-B receptor 3
Type:Protein
Mol. Mass.:110326.17
Organism:Homo sapiens (Human)
Description:P54753
Residue:998
BDBM50311296
NameBDBM50311296
Synonyms:CHEMBL1081498 | N-(2-chlorophenyl)-5-methylpyrazolo[1,5-a]pyridine-3-carboxamide
TypeSmall organic molecule
Emp. Form.C15H12ClN3O
Mol. Mass.285.728
SMILESCc1ccn2ncc(C(=O)Nc3ccccc3Cl)c2c1