Reaction Details
TargetEphrin type-B receptor 3
LigandBDBM50311299
Substrate/Competitorn/a
Meas. Tech.ChEMBL_620507 (CHEMBL1107575)
IC50 2000±n/a nM
Citation Qiao, LChoi, SCase, AGainer, TGSeyb, KGlicksman, MALo, DCStein, RLCuny, GD Structure-activity relationship study of EphB3 receptor tyrosine kinase inhibitors. Bioorg Med Chem Lett19:6122-6 (2009) 
 
Ephrin type-B receptor 3
Name:Ephrin type-B receptor 3
Type:Protein
Mol. Mass.:110326.17
Organism:Homo sapiens (Human)
Description:P54753
Residue:998
BDBM50311299
NameBDBM50311299
Synonyms:5-chloro-N-(2-chlorophenyl)pyrazolo[1,5-a]pyridine-3-carboxamide | CHEMBL1080957
TypeSmall organic molecule
Emp. Form.C14H9Cl2N3O
Mol. Mass.306.147
SMILESClc1ccn2ncc(C(=O)Nc3ccccc3Cl)c2c1