Reaction Details
TargetEphrin type-B receptor 3
LigandBDBM50311301
Substrate/Competitorn/a
Meas. Tech.ChEMBL_620507 (CHEMBL1107575)
IC50 190±n/a nM
Citation Qiao, LChoi, SCase, AGainer, TGSeyb, KGlicksman, MALo, DCStein, RLCuny, GD Structure-activity relationship study of EphB3 receptor tyrosine kinase inhibitors. Bioorg Med Chem Lett19:6122-6 (2009) 
 
Ephrin type-B receptor 3
Name:Ephrin type-B receptor 3
Type:Protein
Mol. Mass.:110326.17
Organism:Homo sapiens (Human)
Description:P54753
Residue:998
BDBM50311301
NameBDBM50311301
Synonyms:CHEMBL1080959 | N-(2-chlorophenyl)-5-methoxypyrazolo[1,5-a]pyridine-3-carboxamide
TypeSmall organic molecule
Emp. Form.C15H12ClN3O2
Mol. Mass.301.728
SMILESCOc1ccn2ncc(C(=O)Nc3ccccc3Cl)c2c1