Reaction Details
TargetEphrin type-B receptor 3
LigandBDBM50311302
Substrate/Competitorn/a
Meas. Tech.ChEMBL_620507 (CHEMBL1107575)
IC50 66±n/a nM
Citation Qiao, LChoi, SCase, AGainer, TGSeyb, KGlicksman, MALo, DCStein, RLCuny, GD Structure-activity relationship study of EphB3 receptor tyrosine kinase inhibitors. Bioorg Med Chem Lett19:6122-6 (2009) 
 
Ephrin type-B receptor 3
Name:Ephrin type-B receptor 3
Type:Protein
Mol. Mass.:110326.17
Organism:Homo sapiens (Human)
Description:P54753
Residue:998
BDBM50311302
NameBDBM50311302
Synonyms:CHEMBL1078107 | N-(2-chlorophenyl)-5-phenylpyrazolo[1,5-a]pyridine-3-carboxamide
TypeSmall organic molecule
Emp. Form.C20H14ClN3O
Mol. Mass.347.798
SMILESClc1ccccc1NC(=O)c1cnn2ccc(cc12)-c1ccccc1