Reaction Details
TargetEphrin type-B receptor 3
LigandBDBM50311306
Substrate/Competitorn/a
Meas. Tech.ChEMBL_620507 (CHEMBL1107575)
IC50 63±n/a nM
Citation Qiao, LChoi, SCase, AGainer, TGSeyb, KGlicksman, MALo, DCStein, RLCuny, GD Structure-activity relationship study of EphB3 receptor tyrosine kinase inhibitors. Bioorg Med Chem Lett19:6122-6 (2009) 
 
Ephrin type-B receptor 3
Name:Ephrin type-B receptor 3
Type:Protein
Mol. Mass.:110326.17
Organism:Homo sapiens (Human)
Description:P54753
Residue:998
BDBM50311306
NameBDBM50311306
Synonyms:CHEMBL1078214 | N-(2-chlorophenyl)-5-(piperidin-1-yl)pyrazolo[1,5-a]pyridine-3-carboxamide
TypeSmall organic molecule
Emp. Form.C19H19ClN4O
Mol. Mass.354.833
SMILESClc1ccccc1NC(=O)c1cnn2ccc(cc12)N1CCCCC1